case law
type: Concept
definition: Case law is the law as found in previous cases—that is, the body of decisions written and developed by judges in the course of ruling on particular cases. Case law is a fundamental element of the English and American common law systems. [Source: The Supreme Court A to Z; Case Law]
broader: sources of law

sources of law
type: Concept
narrower: case law

concepts
type: Collection
type: ConceptGroup
member: case law