central planning
type: Concept
definition: In central-plan economies, major policy decisions are made in advance by the government. Most of the central plan economies were socialist or Communist countries such as the Soviet Union, China, and most of Eastern Europe. [Source: Encyclopedia of Environment and Society; Central Planning]
broader: society

society
type: Concept
narrower: central planning

concepts
type: Collection
type: ConceptGroup
member: central planning