personality
type: Concept
narrower: character

concepts
type: Collection
type: ConceptGroup
member: character

character
type: Concept
definition: The concept of character has been an important one in the lives of American men and in American constructions of masculinity. It can be defined as an internalized commitment to moral or ethical principles, such as honesty, industry, frugality, sobriety, punctuality, and diligence. [Source: American Masculinities: A Historical Encyclopedia; Character]
broader: personality