action control
type: Concept
narrower: choking under pressure

concepts
type: Collection
type: ConceptGroup
member: choking under pressure

choking under pressure
type: Concept
definition: We have all heard the term choking under pressure before. In the sports arena we talk about the bricks in basketball when the game-winning free throw is missed. [Source: Encyclopedia of Social Psychology; Choking Under Pressure]
broader: action control