classroom discourse
type: Concept
definition: Oral communication is an essential component of schooling, without a doubt the single most important vehicle of interaction between teacher and students, as well as among students, as they discuss concepts and ideas. It is also the principal way through which learning is demonstrated. [Source: Encyclopedia of Bilingual Education; Classroom Discourse]
broader: teaching and learning

teaching and learning
type: Concept
narrower: classroom discourse

concepts
type: Collection
type: ConceptGroup
member: classroom discourse