psychological processes
type: Concept
narrower: cohesiveness in groups

concepts
type: Collection
type: ConceptGroup
member: cohesiveness in groups

cohesiveness in groups
type: Concept
definition: When scholars think about factors that cause people to remain in groups and work to achieve collective goals, group cohesiveness comes to mind. There is a general belief that cohesiveness has positive consequences for group processes and outcomes, and therefore, leaders should try to instill and maintain it. [Source: Encyclopedia of Human Relationships; Cohesiveness in Groups]
broader: psychological processes