collapsed and failed states
type: Concept
definition: State collapse and failure appeared as a common feature of the international system after the end of the cold war, though it is not a new phenomenon. The State Failure Task Force: Phase III Findings (Goldstone et al. [Source: The Encyclopedia of Political Science; Collapsed and Failed States]
broader: international relations

international relations
type: Concept
narrower: collapsed and failed states

concepts
type: Collection
type: ConceptGroup
member: collapsed and failed states