collective behavior
type: Concept
definition: Collective behavior is defined as mass activity among a specified population and is often used to describe action of localized mass public activity. Collective action usually occurs among aggregates who meet and disperse and interact on a temporary basis. [Source: Encyclopedia of Anthropology; Behavior, Collective]
broader: symbolic interactionism

symbolic interactionism
type: Concept
narrower: collective behavior

concepts
type: Collection
type: ConceptGroup
member: collective behavior