methods
type: Collection
type: ConceptGroup
member: collinearity

statistics and research methods
type: Concept
narrower: collinearity

collinearity
type: Concept
definition: Collinearity is a situation in which the predictor, or exogenous, variables in a linear regression model are linearly related among themselves or with the intercept term, and this relation may lead to adverse effects on the estimated model parameters, particularly the regression coefficients and their associated standard errors. In practice, researchers often treat correlation between predictor variables as collinearity, but strictly speaking they are not the same; strong correlation implies collinearity, but the opposite is not necessarily true. [Source: Encyclopedia of Research Design; Collinearity]
broader: statistics and research methods