concepts
type: Collection
type: ConceptGroup
member: communicative rationality

decision making
type: Concept
narrower: communicative rationality

communicative rationality
type: Concept
definition: Communicative rationality characterizes a particular logic of interaction among individual (or collective) actors that is determined by argumentative processes. This differs from cases in which payoff structures constrain the strategic calculations of actors (e.g., trade negotiations) or situations where actors unquestioningly adhere to social norms. [Source: Encyclopedia of Governance; Communicative Rationality]
broader: decision making