processes and institutions
type: Concept
narrower: community satisfaction

concepts
type: Collection
type: ConceptGroup
member: community satisfaction

community satisfaction
type: Concept
definition: The term community satisfaction refers to people's subjective evaluations of their own well-being as measured by how well their local community meets their personal needs. The lives of human beings today are dominated by a mass consumer-oriented economy and its concomitant culture. [Source: Encyclopedia of Community: From the Village to the Virtual World; Community Satisfaction]
broader: processes and institutions