complementary methods research
type: Concept
definition: Complementary methods refers to the use of more than one method when a researcher seeks illustration, clarification, or elaboration about research findings. Complementary methods research permits curriculum studies researchers to use quantitative and qualitative methods in the same study as needed to garner deeper insights. [Source: Encyclopedia of Curriculum Studies; Complementary Methods Research]
broader: inquiry and research

inquiry and research
type: Concept
narrower: complementary methods research

methods
type: Collection
type: ConceptGroup
member: complementary methods research