computer-based simulation research
type: Concept
definition: Simulation replicates aspects of real environments through models. A computer-based simulation replicates an environment through a computer program designed to consider multiple variables, interactions, and system constraints. [Source: International Encyclopedia of Organization Studies; Computer-Based Simulation Research]
broader: technologies

technologies
type: Concept
narrower: computer-based simulation research

concepts
type: Collection
type: ConceptGroup
member: computer-based simulation research