computer models
type: Concept
definition: A climate model is a computer-based representation of the Earth system. Climate models solve mathematical equations that describe the planetary energy budget, with the aim of understanding and reproducing the processes that control climate. [Source: Encyclopedia of Global Warming & Climate Change; Computer Models]
broader: climate models

climate models
type: Concept
narrower: computer models

concepts
type: Collection
type: ConceptGroup
member: computer models