computers and humankind
type: Concept
definition: Computers and Evolution At first glance, the average person would be familiar with only the last 30 years of computer history. In fact, the origins of the computer, in the way of simple counting aids, date back at least2,000 years. [Source: Encyclopedia of Anthropology; Computers and Humankind]
broader: research/theoretical frameworks

research/theoretical frameworks
type: Concept
narrower: computers and humankind

concepts
type: Collection
type: ConceptGroup
member: computers and humankind