eyewitness memory
type: Concept
narrower: confidence in identifications

confidence in identifications
type: Concept
definition: The confidence that eyewitnesses express in their decision at an identification test or lineup has long been recognized within the criminal justice system as an indicator of the likely reliability or accuracy of the witness. In contrast, psychology researchers have downplayed the diagnostic value of eyewitness identification confidence. [Source: Encyclopedia of Psychology and Law; Confidence in Identifications]
broader: eyewitness memory

concepts
type: Collection
type: ConceptGroup
member: confidence in identifications