confidence intervals
type: Concept
definition: Confidence intervals (CIs) are common tools of inference, measuring how sure we are of our results. Confidence intervals do the following: Across studies, they tell us how accurately and consistently data operate over time. [Source: Encyclopedia of Measurement and Statistics; Confidence Intervals]
broader: statistics as topic

statistics as topic
type: Concept
narrower: confidence intervals

methods
type: Collection
type: ConceptGroup
member: confidence intervals