inquiry and research
type: Concept
narrower: consequential validity

methods
type: Collection
type: ConceptGroup
member: consequential validity

consequential validity
type: Concept
definition: Consequential validity emerged from concerns related to societal ramifications of assessments. The Standards for Educational and Psychological Testing(American Educational Research Association, 1999) views validity as a unitary concept that measures the degree to which all the accumulated evidence supports the intended interpretation of test scores for the proposed purpose. [Source: The SAGE Encyclopedia of Social Science Research Methods; Consequential Validity]
broader: inquiry and research