contingent exercise
type: Concept
definition: Contingent exercise is a positive punishment procedure sometimes used to decrease problem behaviors. In positive punishment, aversive events or activities are “added” or applied contingent on the occurrence of a behavior.
broader: punishment

punishment
type: Concept
narrower: contingent exercise

concepts
type: Collection
type: ConceptGroup
member: contingent exercise