innovation (business)
type: Concept
narrower: continuous innovation

continuous innovation
type: Concept
alternative label: kaizen
definition: Kaizen is the Japanese term for continuous improvement and refers to Japanese management practices that aim to lead a company to higher quality and superior performance. The philosophy of Kaizen was popularized in the West by Masaaki Imai in his book about Kaizen, which created worldwide interest in the concept. [Source: Encyclopedia of Business in Today's World; Kaizen]
broader: innovation (business)

concepts
type: Collection
type: ConceptGroup
member: continuous innovation