social cognition
type: Concept
narrower: contrast effects

contrast effects
type: Concept
definition: Definition Most judgments in everyday life are evaluative in nature. People may want to know whether a particular grade is good or bad, whether a person is trustworthy, how well someone performed on a test, or what a person's athletic abilities are like. [Source: Encyclopedia of Social Psychology; Contrast Effects]
broader: social cognition

concepts
type: Collection
type: ConceptGroup
member: contrast effects