convergent validity
type: Concept
definition: The argument that the use of multiple methods (e.g. quantitative and qualitative) and analysis at multiple levels (e.g. [Source: The Sage Dictionary of Health and Society; Convergent Validity]
broader: validity

validity
type: Concept
narrower: convergent validity

methods
type: Collection
type: ConceptGroup
member: convergent validity