rural life
type: Concept
narrower: cooperative extension system

concepts
type: Collection
type: ConceptGroup
member: cooperative extension system

cooperative extension system
type: Concept
definition: The cooperative extension system (“Extension”) is the world's largest informal education system. It is part of the outreach mission of the U.S. [Source: Encyclopedia of Community: From the Village to the Virtual World; Cooperative Extension System]
broader: rural life