cornea
type: Concept
definition: A transparent, curved membrane that covers the iris and the pupil. The cornea acts like a “window” because the outside light rays first pass through it. [Source: The SAGE Glossary of the Social and Behavioral Sciences; Cornea]
broader: eyes

eyes
type: Concept
narrower: cornea

concepts
type: Collection
type: ConceptGroup
member: cornea