cross rate
type: Concept
definition: A cross rate reflects the exchange rate between a foreign currency and another foreign currency. It shows the relationship between two foreign currencies with neither currency being the domestic currency. [Source: Encyclopedia of Business in Today's World; Cross Rate]
broader: international monetary system

international monetary system
type: Concept
narrower: cross rate

concepts
type: Collection
type: ConceptGroup
member: cross rate