educational policies
type: Concept
narrower: curriculum standardization

concepts
type: Collection
type: ConceptGroup
member: curriculum standardization

curriculum standardization
type: Concept
definition: Contemporary educational climates and cultures are characterized by standardization practices. The need or requirement to ensure that different elements of curriculum are standardized—are measured against uniformly agreed upon benchmarks or performance indicators—occupies the position of a dominant discourse, according to J. Gee. [Source: Sociology of Education: An A-to-Z Guide; Curriculum Standardization]
broader: educational policies