curriculum theorizing
type: Concept
definition: Curriculum Theorizing: The Reconceptualists, a collection of essays edited by William F. Pinar, is the initial work in reconceptualization's break with the traditional field of curriculum development. The field had been dominated up to that point by the Tylerian paradigm (1950–1970). [Source: Encyclopedia of Curriculum Studies; Curriculum Theorizing]
broader: publications

publications
type: Concept
narrower: curriculum theorizing

concepts
type: Collection
type: ConceptGroup
member: curriculum theorizing