custodians
type: Concept
definition: The global custody business is the safekeeping of clients' assets. It includes processing cross-border securities trades, keeping financial assets safe, and servicing the associated portfolios. [Source: Encyclopedia of Business in Today's World; Custodians]
broader: international accounting

international accounting
type: Concept
narrower: custodians

concepts
type: Collection
type: ConceptGroup
member: custodians