research/theoretical frameworks
type: Concept
narrower: cybernetic modeling

cybernetic modeling
type: Concept
definition: Cybernetics is the study of control and self-organizing processes in systems, including living organisms, human organizations, and machines. Cybernetic modeling is the attempt to use math or visual symbolic representations of system components and processes to understand the effect of feedback on a given system's potential states of organization or performance. [Source: Encyclopedia of Anthropology; Cybernetic Modeling]
broader: research/theoretical frameworks

methods
type: Collection
type: ConceptGroup
member: cybernetic modeling