adult games
type: Concept
narrower: darts

concepts
type: Collection
type: ConceptGroup
member: darts

darts
type: Concept
definition: The game of Darts, in which spiked darts are thrown at a circular target, remains a popular game in Britain, especially in public houses (hotels) and in British communities around the world, although now people in many other countries also play the game. The first record of the game Darts took place in the town of Dartford, in Kent, in the southeast of England. [Source: Encyclopedia of Play in Today's Society; Darts]
broader: adult games