data transformations
type: Concept
definition: Data transformations modify measured values systematically. Epidemiologists often transform measured values so that they conform more closely to a distribution germane to a statistical method that the epidemiologist would like to apply. [Source: Encyclopedia of Epidemiology; Data Transformations]
broader: statistics and research methods

statistics and research methods
type: Concept
narrower: data transformations

methods
type: Collection
type: ConceptGroup
member: data transformations