finance ethics
type: Concept
narrower: deferred compensation plans

deferred compensation plans
type: Concept
definition: Deferred compensation plans refer to arrangements in which employees defer some portion of their current income until a future date. Wages earned by an employee in one period are actually received by the employee at a later date. [Source: Encyclopedia of Business Ethics and Society; Deferred Compensation Plans]
broader: finance ethics

concepts
type: Collection
type: ConceptGroup
member: deferred compensation plans