minority issues
type: Concept
narrower: depolicing

depolicing
type: Concept
definition: During the 1990s, police officers in the United States came under attack for the alleged practice of racial profiling. Activists accused law enforcement of singling out African-American men for stops and searches on the basis of race. [Source: Encyclopedia of Law Enforcement; Depolicing]
broader: minority issues

concepts
type: Collection
type: ConceptGroup
member: depolicing