developmental quotient
type: Concept
definition: A development quotient (DQ), most frequently used with infants or preschool children, is a numerical indicator of a child's growth to maturity across a range of psychosocial competencies. Typically, these include areas such as personal-social development, attention span, expressive and receptive language, visuoperceptual skills, fine and gross motor skills, and initiative and independence, together with aspects of cognitive development, problem solving, and memory. [Source: Encyclopedia of Human Development; Developmental Quotient]
broader: intelligence, ability, and aptitude

intelligence, ability, and aptitude
type: Concept
narrower: developmental quotient

concepts
type: Collection
type: ConceptGroup
member: developmental quotient