developmentally attentive communities
type: Concept
definition: One of the central tenets of developmental theory is that young people grow up in multiple nested contexts: Self-processes, family, school and other organizations, neighborhood, and peer groups do not exist independently of each other but rather are overlapping and interconnecting influences changing over time. The occurrence of these intersecting contextual relationships is a developmental given; whether they are positive developmental influences is not. [Source: Encyclopedia of Applied Developmental Science; Developmentally Attentive Communities]
broader: ecology of human development

ecology of human development
type: Concept
narrower: developmentally attentive communities

concepts
type: Collection
type: ConceptGroup
member: developmentally attentive communities