dialogic
type: Concept
definition: The concept of the dialogic is drawn from the work of Bakhtin and refers to the idea of the ‘two-directionality’ or ‘multi-accentuality’ of signs and meaning. Here words are directed simultaneously towards another speaking subject and towards another word. [Source: The SAGE Dictionary of Cultural Studies; Dialogic]
broader: focus groups

focus groups
type: Concept
narrower: dialogic

concepts
type: Collection
type: ConceptGroup
member: dialogic