differentiated staffing
type: Concept
definition: Differentiated staffing is the organization of school staff based on varying levels of experience and qualification. In a differentiated staffing structure, teachers and other instructional staff are assigned different titles and sometimes different pay grades based on their experience or degree of demonstrated effectiveness in the classroom. [Source: Encyclopedia of Educational Reform and Dissent; Differentiated Staffing]
broader: professional development

professional development
type: Concept
narrower: differentiated staffing

concepts
type: Collection
type: ConceptGroup
member: differentiated staffing