meta-analysis
type: Concept
narrower: diffuse comparisons

diffuse comparisons
type: Concept
definition: Techniques used in ∗meta-analysis to compare the amount of heterogeneity in the analyzed studies’ ∗significance levels and ∗effect sizes. The more heterogeneity or “diffuseness,” the harder it is to integrate the studies. [Source: Dictionary of Statistics & Methodology; Diffuse Comparisons]
broader: meta-analysis

methods
type: Collection
type: ConceptGroup
member: diffuse comparisons