disaster relief methods and practices
type: Concept
narrower: disaster management

disaster management
type: Concept
definition: The actions taken by an organization in response to unexpected events that are adversely affecting people or resources and threatening the continued operation of the organization. For example, three years after the disastrous merger of Time Warner and America Online, the world's largest media company instigated a disaster recovery plan and expects earnings growth in 2004.. [Source: Dictionary of Strategy: Strategic Management A-Z; Disaster Management (Disaster Recovery Plan)]
broader: disaster relief methods and practices

concepts
type: Collection
type: ConceptGroup
member: disaster management