divergent thinking
type: Concept
definition: Divergent thinking represents the potential for creative thinking and problem solving. It is not synonymous with actual creative behavior but has proven to be a good estimate of it. [Source: Encyclopedia of Giftedness, Creativity, and Talent; Divergent Thinking]
broader: creativity studies

creativity studies
type: Concept
narrower: divergent thinking

concepts
type: Collection
type: ConceptGroup
member: divergent thinking