dolphins
type: Concept
definition: Dolphins have figured prominently in society for ages. To the Minoans, as far back as 2000 b.c.e., dolphins were symbols of joy and music. [Source: Encyclopedia of Environment and Society; Dolphins]
broader: animals

animals
type: Concept
narrower: dolphins

concepts
type: Collection
type: ConceptGroup
member: dolphins