concepts
type: Collection
type: ConceptGroup
member: dominance

dominance
type: Concept
definition: A term used by Marxist theorists to describe the hierarchy and interaction of elements involved in social formation. Louis Althusser (1968) first used the term in the 1960s to explain a process of dominance and subordination that results in social structures. [Source: The SAGE Glossary of the Social and Behavioral Sciences; Dominance]
broader: basis for making the decision

basis for making the decision
type: Concept
narrower: dominance