finance ethics
type: Concept
narrower: due diligence

concepts
type: Collection
type: ConceptGroup
member: due diligence

due diligence
type: Concept
definition: Due diligence is a standard of vigilance, attentiveness, and care that is often exercised in various professional and societal settings. The effort is measured by the circumstances under which it is applied, with the expectation that it will be conducted with a level of reasonableness and prudence appropriate for the particular circumstances. [Source: Encyclopedia of Business Ethics and Society; Due Diligence]
broader: finance ethics