methods for studying relationships
type: Concept
narrower: dyadic data analysis

dyadic data analysis
type: Concept
definition: Dyadic data analysis refers to a set of statistical techniques that model data from individuals who are connected or paired in some way. Dyads may be siblings, spouses, roommates, coworkers, neighbors, colleagues, or any other pairing that may be of interest to a researcher. [Source: Encyclopedia of Human Relationships; Dyadic Data Analysis]
broader: methods for studying relationships

methods
type: Collection
type: ConceptGroup
member: dyadic data analysis