dysphagia
type: Concept
definition: Dysphagia is a condition of having difficulty swallowing. Two classifications exist: transfer dysphagia and esophageal dysphagia. [Source: Encyclopedia of Global Health; Dysphagia]
broader: localized diseases

localized diseases
type: Concept
narrower: dysphagia

concepts
type: Collection
type: ConceptGroup
member: dysphagia