early release programs
type: Concept
definition: Sooner or later, almost every incarcerated person is released back into society. Early release is the means by which a convicted offender, serving a sentence in some type of correctional facility, is discharged some time before completing his or her total term, be it days, months, or years. [Source: Encyclopedia of Crime and Punishment; Early Release Programs]
broader: corrections

corrections
type: Concept
narrower: early release programs

concepts
type: Collection
type: ConceptGroup
member: early release programs