easy and difficult languages
type: Concept
definition: The idea that some languages are difficult to learn while others are easy is common and widespread. Many people around the world believe it to be true. [Source: Encyclopedia of Bilingual Education; Easy and Difficult Languages]
broader: family, communities, and society

family, communities, and society
type: Concept
narrower: easy and difficult languages

concepts
type: Collection
type: ConceptGroup
member: easy and difficult languages