education for thinking
type: Concept
definition: Senge (1990) suggests that a culture is people thinking together. By thinking together, the group mind is able to clarify issues, solve problems, and accommodate differences. [Source: Encyclopedia of Applied Developmental Science; Thinking, Education for]
broader: development-promoting interventions

development-promoting interventions
type: Concept
narrower: education for thinking

concepts
type: Collection
type: ConceptGroup
member: education for thinking