effects of soap operas
type: Concept
definition: Soap operas have existed almost as long as radio and television have. The term soap opera is, however, not used all over the world; in Latin America, the most popular corresponding program genre is the telenovela, and in Asia, it is drama serials. [Source: Encyclopedia of Children, Adolescents, and the Media; Soap Operas, Effects of]
broader: television

television
type: Concept
narrower: effects of soap operas

concepts
type: Collection
type: ConceptGroup
member: effects of soap operas