representation and electoral systems
type: Concept
narrower: election commission

organizations
type: Collection
type: ConceptGroup
member: election commission

election commission
type: Concept
definition: Election commissions are a special category of electoral management bodies emerging after World War II (1939–1945). They also appear in the form of a department of elections, an electoral council, an electoral unit, or an electoral board. [Source: The Encyclopedia of Political Science; Election Commission]
broader: representation and electoral systems